{"text_format":"1","workbook":"xlsx","n_sheets":13,"sheets":["WERCS Questionnaire","NI Sample Requirements","NI Field SOP","New Item Form","New Item Form ","DIF COST BY DC","PSE Validation Form","Volume & Qty of Children","Pckg Requirements","Maintenance Form","VALIDATION","VALIDATION CM","Options"],"not_rendered":{"charts":0,"images":6,"macros":1,"external_links":1,"defined_names":24,"comments":2,"pivot_tables":0},"unopened":[],"bounds":{"document_bytes":16777216,"sheet_cells":100000,"rows_first":2000,"rows_last":500,"rows_between":2000,"halvings":0,"cell_chars":16384,"cell_head_chars":4096},"cells_cut":0,"cells_raw":0,"read":"whole","date_system":"1900"}

{"sheet":"WERCS Questionnaire","index":0,"n_rows":95,"n_cols":12,"rows_kept":95,"cut":false,"hidden":false,"merged":[[1,1,1,7],[3,0,4,9],[7,0,10,12],[12,0,12,4],[36,2,36,11],[14,0,14,13],[18,0,18,4],[22,0,23,12],[34,2,34,11],[43,0,43,13],[49,0,49,10],[51,0,51,13],[53,0,54,13],[39,0,39,13],[41,6,41,8],[94,0,94,13],[45,0,45,5],[45,6,45,13],[25,0,29,13],[30,0,30,3],[76,0,76,13],[78,0,79,13],[81,0,85,13],[87,0,88,13],[90,0,90,13],[92,0,92,13],[56,0,58,13],[60,0,61,13],[63,0,67,13],[69,0,71,13],[73,0,74,13]]}
[]
[null,"WERCSmart ASSESSMENT FOR NEW ITEM FORM"]
[]
["By filling out this assessment you certify that all information is truthful, accurate, and that no material information has been omitted."]
[]
[]
{"$rows_left_out":90}
{"sheet":"NI Sample Requirements","index":1,"n_rows":21,"n_cols":1,"rows_kept":21,"cut":false,"hidden":false,"merged":[[8,0,8,9],[9,0,9,9],[3,0,3,10],[4,0,4,10],[5,0,5,9],[6,0,6,9],[7,0,7,9]]}
["We are in need of two samples of live product sent to the photo studio to fulfill the requirements involving cvs.com, promo personalization and other major initiatives that cvs is pursuing."]
["This includes capturing products both in and out of package at multiple angles."]
["Please note:"]
["1-We accept live samples only, we do not accept artist proofs or digital \"vendor art\""]
["2-If your product is merchandised in a prepack or PDQ, please send a full prepack or PDQ."]
["3-If an item has multiple upc's associated to it, please send two of each upc."]
{"$rows_left_out":16}
{"sheet":"NI Field SOP","index":2,"n_rows":120,"n_cols":5,"rows_kept":120,"cut":false,"hidden":false,"merged":[[63,0,63,3],[80,0,80,3],[100,0,100,3],[0,0,1,3],[2,0,2,3],[18,0,18,3],[52,0,52,3],[87,0,87,3],[32,0,32,3],[73,0,73,3]]}
["CVS NEW ITEM FORM GUIDELINES"]
[]
["Vendor Mandatory Fields"]
["Field Name","Responsibility",null,"Description"]
["CVS Item #","IC","Mandatory Field Y/N","Item Coordinator will enter in the Item # assigned by the system as a last step."]
["WPS ID **NEW**","Supplier","Y","Enter the WPS ID # that you received from the WERCs in this field. Contact the CVS WERCSmart team with any questions.  wercsinfo@cvscaremark.com"]
{"$rows_left_out":115}
{"sheet":"New Item Form","index":3,"n_rows":173,"n_cols":83,"rows_kept":173,"cut":false,"hidden":false,"merged":[[0,0,0,4],[1,0,1,4],[12,6,12,18],[75,46,75,47],[56,24,75,41],[75,0,75,3],[75,44,75,45],[75,10,75,11],[75,12,75,13],[75,14,75,15],[75,16,75,17],[75,18,75,19],[75,22,75,23],[75,4,75,5],[75,6,75,7],[75,8,75,9],[57,5,57,8],[57,15,57,18],[59,0,59,2],[59,3,59,6],[59,8,59,10],[59,11,59,16],[61,0,61,3],[61,4,61,5],[60,44,60,48],[14,6,14,18],[16,6,16,18],[30,5,30,18],[33,1,33,12],[34,0,34,3],[22,11,22,20],[20,6,20,20],[32,0,32,3],[34,4,34,5],[32,7,32,14],[32,15,32,18],[18,3,18,4],[18,12,18,13],[24,0,24,2],[18,6,18,11],[18,15,18,17],[18,18,18,19],[24,13,24,14],[24,15,24,16],[24,17,24,20],[27,0,28,21],[34,13,34,14],[34,18,34,20],[22,3,22,4],[24,3,24,6],[53,4,53,5],[53,13,53,16],[55,9,55,10],[55,15,55,16],[55,12,55,14],[55,5,55,8],[36,18,36,20],[32,4,32,5],[55,18,55,19],[38,4,38,5],[38,11,38,12],[38,14,38,16],[38,17,38,18],[47,13,47,16],[41,10,42,20],[52,32,52,34],[52,35,52,36],[51,31,51,33],[51,34,51,36],[50,24,50,30],[42,24,42,27],[52,28,52,29],[51,24,51,26],[50,31,50,32],[28,29,28,31],[28,24,28,28],[36,8,36,9],[40,32,40,33],[21,35,21,37],[21,38,21,39],[23,24,23,26],[23,27,23,37],[21,30,21,33],[24,28,24,32],[24,39,24,40],[24,24,24,27],[24,33,24,38],[21,24,21,29],[27,24,27,26],[38,24,38,26],[26,28,26,30],[29,24,29,29],[32,24,32,28],[33,24,33,28],[32,29,32,38],[33,29,33,38],[34,27,34,32],[38,27,38,34],[11,38,11,39],[13,34,13,36],[15,24,15,27],[15,28,15,29],[15,30,15,31],[15,32,15,34],[13,38,13,39],[17,34,17,36],[17,37,17,40],[17,24,17,26],[17,27,17,33],[15,35,15,37],[15,38,15,39],[11,24,11,29],[13,24,13,29],[11,30,11,32],[19,27,19,38],[23,38,23,39],[19,24,19,26],[26,32,26,36],[26,38,26,39],[27,27,27,28],[109,4,109,7],[109,14,109,17],[101,2,101,15],[103,5,103,10],[103,18,103,19],[105,2,105,3],[105,10,105,15],[95,4,95,19],[97,4,97,19],[99,3,99,4],[99,12,99,14],[93,4,93,11],[93,13,93,19],[63,3,63,8],[63,18,63,19],[67,0,67,3],[73,0,73,2],[71,0,71,2],[71,9,71,10],[67,4,67,13],[65,4,65,13],[63,0,63,2],[63,10,63,17],[88,4,88,20],[91,4,91,11],[91,13,91,19],[73,5,73,7],[73,8,73,9],[73,12,73,14],[73,16,73,17],[73,18,73,19],[173,6,173,7],[173,17,173,18],[158,15,158,17],[36,16,36,17],[36,14,36,15],[71,17,71,18],[171,4,171,7],[171,15,171,18],[156,4,156,8],[61,9,61,11],[61,12,61,13],[73,10,73,11],[45,14,45,15],[45,16,45,17],[45,18,45,20],[47,5,47,7],[50,5,50,9],[50,10,50,11],[50,13,50,17],[50,18,50,20],[42,4,42,5],[43,1,43,12],[45,8,45,9],[42,0,42,3],[3,0,3,48],[4,42,4,48],[5,42,5,45],[6,42,6,43],[6,44,6,48],[7,42,7,43],[9,42,9,43],[7,44,7,48],[9,44,9,48],[5,10,5,12],[4,0,4,3],[4,4,4,8],[5,24,5,32],[7,7,7,9],[4,19,4,24],[5,13,5,16],[7,0,7,3],[7,37,7,40],[4,13,4,18],[4,26,4,35],[9,27,9,38],[7,33,7,36],[6,0,6,11],[7,17,7,20],[10,6,10,18],[4,37,4,39],[8,0,8,20],[7,10,7,13],[7,15,7,16],[19,42,19,43],[15,44,15,48],[16,44,16,48],[18,44,18,48],[19,44,19,48],[10,42,10,43],[12,42,12,43],[13,42,13,43],[10,44,10,48],[12,44,12,48],[13,44,13,48],[15,42,15,43],[16,42,16,43],[18,42,18,43],[11,33,11,37],[13,30,13,32],[7,24,7,25],[7,26,7,31],[9,24,9,26],[25,44,25,48],[27,44,27,48],[28,44,28,48],[21,42,21,43],[22,42,22,43],[24,42,24,43],[21,44,21,48],[22,44,22,48],[24,44,24,48],[25,42,25,43],[27,42,27,43],[28,42,28,43],[36,44,36,48],[37,44,37,48],[39,44,39,48],[30,42,30,43],[31,42,31,43],[33,42,33,43],[34,42,34,43],[30,44,30,48],[31,44,31,48],[33,44,33,48],[34,44,34,48],[36,42,36,43],[37,42,37,43],[39,42,39,43],[51,44,51,48],[52,44,52,48],[54,44,54,48],[45,44,45,48],[46,44,46,48],[48,44,48,48],[49,44,49,48],[40,42,40,43],[42,42,42,43],[43,42,43,43],[40,44,40,48],[42,44,42,48],[43,44,43,48],[35,28,35,32],[61,44,61,48],[63,44,63,48],[64,44,64,48],[70,42,70,43],[72,42,72,43],[73,42,73,43],[70,44,70,48],[72,44,72,48],[73,44,73,48],[66,42,66,43],[67,42,67,43],[69,42,69,43],[66,44,66,48],[67,44,67,48],[69,44,69,48],[63,42,63,43],[64,42,64,43],[55,44,55,48],[57,44,57,48],[58,44,58,48],[51,42,51,43],[52,42,52,43],[54,42,54,43],[60,0,60,3],[53,31,53,39],[27,31,27,36],[27,37,27,38],[60,42,60,43],[61,42,61,43],[55,42,55,43],[57,42,57,43],[58,42,58,43],[45,42,45,43],[46,42,46,43],[48,42,48,43],[49,42,49,43],[48,38,48,39],[48,28,48,31],[47,31,47,33],[42,28,42,37],[43,32,43,35],[46,28,46,36],[49,24,49,29],[49,31,49,32],[51,27,51,29],[28,39,28,40],[29,30,29,36]]}
["Supplier fields",null,null,null,null,null,null,"Latest Update 2/2022"]
["Category Manage Fields"]
[null,"Item Coordinator Fields"]
["                   CVS DOMESTIC WAREHOUSE NEW ITEM INFORMATION FORM "]
["CVS Item Number",null,null,null,null,null,null,null,null,null,null,null,null,"Vendor % Complete:",null,null,null,null,null,{"$f":"(IF(OR(F8<>\"\",K8<>\"\",R8<>\"\"),1,0)+IF(OR(G11<>\"\",G13<>\"\",G15<>\"\"),1,0)+COUNTA(D19,M19,G21,D23,L23,D25,E33,D37,I37,O37,S37,E39,L39,E54,N54,D56,J56,P56,S56,F58,P58,L60,E62,M62,D64,D72,J72,R72,D74,I74,E35,N35,S19,P74))/36","v":0},null,null,null,null,null,null,"Category Manager % Complete:",null,null,null,null,null,null,null,null,null,null,{"$f":"((COUNTA(AA8,AE12,AM14,AB18,AB24,N6,AL18,AM16)+IF(AB20<>\"\",1,0))+IF(AC25<>\"Select Payment Type\",1,0)+IF(AE14<>\"\",1,0)+IF(AN25<>\"\",1,0)+IF(AE22<>\"\",1,0))/11","v":9.0909090909090912E-2},null,null,null,null,"Version 2.0.4",null,null,null,null,null,null,null,null,null,null,null,null,null,null,null,null,null,null,null,null,null,null,null,null,null,null,null,null,null,null,null,null,null,null,null,null,null,null,"CT"]
["Vendor Fields Mandatory",null,null,null,null,null,null,null,null,null,"MHE",null,null,null,null,null,null,null,null,null,null,null,null,null,"CATEGORY MANAGER FIELDS",null,null,null,null,null,null,null,null,null,null,null,null,null,null,null,null,null,"Additional UPC's",null,null,null,null,null,null,null,null,null,null,null,null,null,null,null,null,null,null,null,null,null,null,"Regular",null,null,null,null,null,null,null,null,"Credit Card",null,"Store Will Tag",null,null,null,null,"DS"]
{"$rows_left_out":168}
{"sheet":"New Item Form ","index":4,"n_rows":150,"n_cols":84,"rows_kept":150,"cut":false,"hidden":true,"merged":[[67,40,67,42],[136,38,136,40],[138,32,138,34],[167,55,167,62],[127,4,127,19],[136,32,136,34],[142,32,142,34],[142,38,142,40],[144,32,144,34],[144,38,144,40],[136,24,136,28],[138,24,138,28],[140,24,140,28],[142,24,142,28],[144,24,144,28],[129,3,129,4],[131,2,131,15],[166,54,166,62],[98,1,98,2],[163,54,163,62],[164,54,164,62],[73,33,73,36],[165,54,165,62],[80,3,80,10],[59,54,59,59],[63,43,63,44],[59,60,59,63],[55,58,55,60],[140,32,140,34],[140,38,140,40],[46,61,46,63],[139,14,139,17],[135,10,135,15],[103,46,103,62],[98,3,98,10],[98,11,98,13],[96,15,96,17],[67,51,67,60],[61,24,61,27],[69,27,69,28],[107,4,107,8],[84,5,84,14],[88,17,88,20],[88,5,88,11],[67,29,67,33],[69,24,69,26],[84,0,84,4],[61,38,61,44],[182,55,182,62],[179,54,179,62],[180,54,180,62],[181,54,181,62],[170,46,171,50],[170,51,171,62],[176,39,176,43],[178,26,178,43],[179,32,179,43],[180,32,180,43],[181,30,181,43],[182,31,182,43],[170,27,171,43],[173,27,173,43],[176,60,176,62],[174,51,174,62],[174,27,174,43],[175,30,175,43],[176,27,176,34],[173,51,173,62],[177,50,177,62],[178,54,178,62],[158,51,158,62],[159,51,159,62],[128,27,128,41],[73,37,73,40],[74,36,74,37],[92,27,92,41],[134,24,134,41],[138,38,138,40],[94,46,94,62],[96,46,96,62],[98,46,98,62],[99,46,99,62],[77,24,77,41],[73,28,73,31],[116,27,116,41],[104,46,104,62],[161,51,161,56],[160,53,160,62],[161,60,161,62],[162,50,162,62],[82,0,82,3],[101,46,101,62],[105,46,105,62],[79,46,79,62],[81,46,81,62],[83,46,83,62],[84,27,84,41],[92,0,92,2],[94,0,94,2],[80,27,80,41],[96,0,96,3],[104,27,104,41],[96,27,96,41],[92,3,92,8],[92,13,92,20],[94,3,94,8],[94,13,94,20],[102,46,102,62],[155,46,156,50],[155,51,156,62],[59,46,59,49],[65,50,65,52],[71,37,71,43],[73,42,73,44],[61,51,61,61],[48,58,48,63],[57,15,57,18],[61,0,61,6],[68,0,68,3],[63,29,63,33],[63,35,63,42],[59,36,59,38],[65,24,65,27],[63,24,63,28],[69,36,69,38],[65,28,65,30],[52,43,52,47],[52,24,52,28],[48,41,48,42],[48,28,48,34],[52,29,52,35],[55,3,55,6],[59,50,59,52],[63,51,63,52],[54,52,54,53],[55,46,55,47],[55,48,55,50],[52,54,52,55],[55,43,55,44],[55,39,55,42],[48,48,48,51],[46,45,46,50],[48,44,48,47],[48,36,48,40],[46,55,46,60],[55,52,55,57],[40,62,40,63],[25,27,25,30],[27,28,27,31],[29,44,29,47],[40,51,40,53],[23,51,23,55],[29,41,29,42],[19,30,19,46],[25,52,25,57],[27,53,27,59],[21,58,21,61],[27,48,27,51],[27,43,27,47],[25,43,25,46],[25,35,25,38],[38,53,38,55],[29,58,29,63],[33,47,33,50],[38,59,38,61],[27,60,27,63],[21,53,21,56],[37,24,37,63],[22,54,22,63],[15,0,15,3],[6,53,6,58],[36,3,36,4],[38,3,38,6],[42,46,42,49],[29,48,29,51],[38,30,38,46],[40,45,40,49],[42,39,42,40],[42,34,42,38],[29,36,29,40],[42,42,42,45],[42,29,42,32],[29,28,29,34],[14,24,14,29],[14,30,14,38],[42,56,42,58],[9,33,9,38],[32,3,32,4],[23,47,23,50],[36,11,36,21],[15,7,15,9],[15,10,15,13],[13,18,13,20],[15,17,15,20],[0,58,0,63],[21,62,21,63],[9,51,9,52],[14,55,14,56],[19,59,19,61],[19,53,19,55],[4,53,4,57],[9,54,9,57],[0,0,0,57],[2,0,2,22],[3,0,3,22],[2,36,2,40],[2,50,2,54],[4,0,4,21],[9,44,9,50],[7,0,7,21],[19,24,19,29],[9,0,9,21],[9,24,9,29],[14,61,14,62],[13,10,13,14],[11,13,11,16],[16,0,16,20],[183,33,183,43],[105,4,105,8],[34,6,34,21],[61,33,61,37],[65,41,65,43],[133,5,133,10],[133,18,133,19],[129,12,129,14],[124,27,124,41],[120,27,120,41],[59,39,59,42],[73,24,73,27],[121,4,121,11],[96,4,96,13],[112,4,112,20],[114,4,114,20],[116,4,116,20],[46,40,46,43],[53,5,53,7],[125,4,125,19],[132,27,132,41],[118,4,118,20],[112,27,112,41],[82,18,82,21],[4,60,4,63],[9,58,9,63],[5,7,5,21],[4,29,4,30],[9,30,9,31],[9,39,9,43],[4,38,4,39],[33,41,33,42],[23,30,23,34],[32,11,32,13],[23,24,23,29],[32,19,32,20],[27,37,27,40],[10,0,10,21],[23,36,23,41],[11,34,11,36],[6,0,6,21],[4,32,4,37],[4,24,4,28],[7,24,7,39],[6,29,6,39],[8,0,8,6],[8,7,8,21],[15,15,15,16],[203,6,203,7],[188,29,188,33],[156,27,156,43],[139,4,139,7],[158,27,158,43],[65,4,65,7],[74,3,74,19],[71,30,71,35],[103,4,103,8],[100,27,100,41],[88,27,88,41],[108,27,108,41],[110,42,149,63],[87,46,87,62],[88,46,88,62],[89,46,89,62],[90,46,90,62],[86,4,86,5],[84,18,84,19],[86,17,86,19],[80,18,80,21],[123,4,123,11],[123,13,123,19],[176,51,176,56],[211,26,211,28],[175,53,175,62],[160,27,160,43],[61,17,61,19],[70,5,70,20],[121,13,121,19],[82,4,82,10],[135,2,135,3],[193,54,193,62],[186,4,186,8],[203,17,203,18],[201,4,201,7],[189,51,189,62],[190,53,190,62],[185,46,186,50],[188,15,188,17],[84,46,84,62],[85,46,85,62],[86,46,86,62],[100,46,100,62],[205,27,205,29],[209,26,209,28],[191,60,191,62],[201,15,201,18],[217,31,217,36],[192,29,192,40],[190,31,190,35],[215,29,215,40],[211,37,211,39],[185,51,186,62],[188,51,188,62],[209,37,209,39],[213,32,213,40],[197,55,197,62],[205,40,205,42],[203,33,203,35],[203,40,203,42],[194,54,194,62],[195,54,195,62],[196,54,196,62],[191,51,191,56],[192,50,192,62],[196,31,196,41],[198,34,198,43],[188,40,188,43],[63,60,63,62],[40,9,40,13],[11,43,11,47],[11,57,11,63],[40,54,40,57],[55,36,55,38],[57,36,57,38],[46,32,46,34],[23,42,23,45],[33,28,33,34],[52,58,52,61],[21,45,21,49],[21,42,21,44],[38,14,38,19],[44,51,44,56],[46,51,46,53],[44,35,44,38],[44,43,44,46],[44,27,44,30],[45,9,45,11],[53,12,53,14],[43,24,43,35],[43,4,43,12],[40,14,40,18],[55,29,55,31],[57,29,57,31],[59,29,59,31],[73,45,73,48],[14,45,14,50],[45,0,45,8],[43,0,43,3],[65,19,65,20],[68,4,68,13],[51,4,51,5],[55,16,55,20],[51,13,51,16],[53,19,53,21],[65,14,65,15],[67,6,67,13],[61,14,61,16],[61,7,61,12],[57,5,57,8],[67,0,67,5],[40,0,40,2],[59,43,59,44],[72,7,72,19],[61,28,61,31],[40,3,40,6]]}
["                                 CVS DOMESTIC WAREHOUSE NEW ITEM INFORMATION FORM ",null,null,null,null,null,null,null,null,null,null,null,null,null,null,null,null,null,null,null,null,null,null,null,null,null,null,null,null,null,null,null,null,null,null,null,null,null,null,null,null,null,null,null,null,null,null,null,null,null,null,null,null,null,null,null,null,null,"Last Revised 5/19/2014  CSV V.12"]
[null,null,null,null,null,null,null,null,null,null,null,null,null,null,null,null,null,null,null,null,null,null,null,null,null,null,null,"Vendor Required Fields",null,null,null,null,null,null,null,null,{"$f":"IF(OR(COUNTIF(VALIDATION!D:D,S14)>1,S14=\"\"),\"\",\"X\")","v":""},null,"Buyer Required Fields",null,null,null,null,null,null,{"$f":"IF(OR(COUNTIF('VALIDATION CM'!D:D,D81)>1,D81=\"\"),\"\",\"X\")","v":""}]
["Instructions: Vendors must complete all bolded fields on page 1 and present to Category Manager",null,null,null,null,null,null,null,null,null,null,null,null,null,null,null,null,null,null,null,null,null,null,null,null,null,null,null,null,null,null,null,null,"CVS Item #",null,null,null,null,null,null,null,null,null,null,null,"Replicate Item #",null,null,null,null,null,null,null,null,null,null,null,null,null,null,null,null,null,null,null,"Regular",null,null,null,null,null,null,null,null,"Credit Card",null,"Store Will Tag",null,null,null,null,"AS"]
["along with the Material Safety Data Sheet (MSDS) to be used for Determination of proper shipping",null,null,null,null,null,null,null,null,null,null,null,null,null,null,null,null,null,null,null,null,null,null,null,"DESCRIPTION   (Step 5)",null,null,null,null,null,null,null,null,null,null,null,null,null,null,null,null,null,null,null,null,null,null,null,null,null,null,null,null,null,null,null,null,null,null,null,null,null,null,null,null,"Bonus",null,null,null,null,null,null,null,null,"CVS Gift Card",null,"DC Will Tag",null,null,null,null,"BX"]
["storage, and disposal handling. CPSIA compliance also required if applicable. WERCSmart Assessment must be provided to proceed in item setup. Vendor should fill out the Item Type field and then use the error list tabs to make sure all applicable fields are filled in. When they are an X will appear in the Vendor Required Fields box.",null,null,null,null,null,null,null,null,null,null,null,null,null,null,null,null,null,null,null,null,null,null,null,"Controlled Content",null,null,null,null,null,null,null,"Controlled Content %",null,null,null,null,null,null,null,null,"Age Dosing",null,null,null,null,null,null,null,"Diet & Fit Choices",null,null,null,null,null,null,null,null,"Facts Box",null,null,null,null,null,null,"LIP",null,null,null,null,null,null,null,null,"Debit Card",null,"Manufacturer Will Tag",null,null,null,null,"CA"]
["*CPSIA requirements for new items ",null,null,null,null,null,null,"http://www.cpsc.gov/ABOUT/Cpsia/cpsia.HTML",null,null,null,null,null,null,null,null,null,null,null,null,null,null,null,null,null,null,null,null,null,null,null,null,null,null,null,null,null,null,null,null,null,null,null,null,null,null,null,null,null,null,null,null,null,null,null,null,null,null,null,null,null,null,null,null,null,null,null,null,null,null,null,null,null,null,"Money Gift Card",null,null,null,null,null,null,"CT"]
{"$rows_left_out":145}
{"sheet":"DIF COST BY DC","index":5,"n_rows":23,"n_cols":3,"rows_kept":23,"cut":false,"hidden":false,"merged":[]}
["PRICING INFO- Enter costs by DC "]
["Vendor Item #"]
["DC Name","DC","COST "]
["Bessemer","AL"]
["Arizona","BV"]
["Conroe","CR "]
{"$rows_left_out":18}
{"sheet":"PSE Validation Form","index":6,"n_rows":18,"n_cols":8,"rows_kept":18,"cut":false,"hidden":false,"merged":[[0,0,0,17],[1,0,1,17],[3,4,3,5],[3,10,3,16],[5,3,5,4],[7,4,7,16],[21,3,21,16],[13,4,13,5],[15,4,15,5],[17,3,17,16],[18,3,18,16],[19,3,19,16],[20,3,20,16]]}
["PSE Validation Form"]
["Instructions: Please fill out the following information for any item containing PSE (Pseudophedrine). Please note, by filling out this form you agree that the information you have provided regarding the PSE Base Gram Weight and PSE Salt Gram weight has been tested and is accurate to the best of your knowledge. You also agree that the NDC number you have provided has been issued by the FDA."]
[]
["Supplier Number",null,null,null,null,null,null,"Supplier Name"]
[]
["Item Number"]
{"$rows_left_out":13}
{"sheet":"Volume & Qty of Children","index":7,"n_rows":61,"n_cols":7,"rows_kept":61,"cut":false,"hidden":false,"merged":[[20,0,20,5],[26,0,26,5],[32,0,32,5],[43,0,43,10]]}
["It is extremely important that your pallet plan information is accurate - CVS has hard stops in the system to prevent entry of any dimension that do not meet the volume requirements - example an each cannot be bigger than an inner and an inner cannot be bigger than a case - below are some examples and information to help you get there.  "]
["Height, Width, Depth is in inches "]
["Case weight must be in pounds"]
["Only one decimal place round up to the next number"]
[]
["Volume is derived by: "]
{"$rows_left_out":56}
{"sheet":"Pckg Requirements","index":8,"n_rows":0,"n_cols":0,"rows_kept":0,"cut":false,"hidden":false,"merged":[]}

{"sheet":"Maintenance Form","index":9,"n_rows":24,"n_cols":15,"rows_kept":24,"cut":false,"hidden":false,"merged":[[14,14,14,15],[15,14,15,15],[16,14,16,15],[5,14,5,15],[8,14,8,15],[9,14,9,15],[10,14,10,15],[11,14,11,15],[0,0,0,15],[1,1,1,15],[2,14,2,15],[3,14,3,15],[4,14,4,15],[17,14,17,15],[20,14,20,15],[21,14,21,15],[22,14,22,15],[23,14,23,15]]}
["Pallet Plan and Size Change Maintenance Form"]
["Instructions:","This form should be used for all items requiring a Size Change, UPC, Case Pack Change and/or Pallet Plan change                                                                                                                                                           \nPrior to completing this form refer to tabs Qty of Children Example and Packaging Requirements\nONLY include the item attributes that are changing\nWhen clicking within each cell, refer to notes for additional instructions"]
["Item Number:",null,"Current Package Size","New Package Size","New Shelf Pack","Quantity Of Children","Height ","Width","Depth","Weight","Current UPC","New UPC","Layers Per Pallet","Cases Per Layer","Comments\n (i.e. effective date)"]
[null,"Case Level"]
["Item Description:","Inner Level"]
[null,"Each Level"]
{"$rows_left_out":19}
{"sheet":"VALIDATION","index":10,"n_rows":300,"n_cols":4,"rows_kept":300,"cut":false,"hidden":true,"merged":[]}
["Please enter","Entered","Required","Item Type"]
[null,null,null,"Standard"]
[" MHE",{"$f":"IF('New Item Form '!C14<>\"\",1,0)","v":0},1,{"$f":"IF((B3-C3)<0,\"Standard\",\"\")","v":"Standard"}]
[" UPC",{"$f":"IF(OR('New Item Form '!G19<>\"\",'New Item Form '!G21<>\"\",'New Item Form '!L23<>\"\",'New Item Form '!G27<>\"\",'New Item Form '!G29<>\"\",'New Item Form '!G31<>\"\"),1,0)","v":0},1,{"$f":"IF((B4-C4)<0,\"Standard\",\"\")","v":"Standard"}]
[" Supplier Item Description",{"$f":"IF('New Item Form '!G35<>\"\",1,0)","v":0},1,"Standard"]
[" CVS Supplier #",{"$f":"IF('New Item Form '!D37<>\"\",1,0)","v":0},1,"Standard"]
{"$rows_left_out":295}
{"sheet":"VALIDATION CM","index":11,"n_rows":88,"n_cols":4,"rows_kept":88,"cut":false,"hidden":true,"merged":[]}
["Please enter","Entered","Required","Item Type"]
[null,null,null,"Cycle pre-pack"]
[" Item Type",{"$f":"IF('New Item Form '!D81<>\"\",1,0)","v":0},1,{"$f":"IF((B3-C3)<0,\"Cycle pre-pack\",\"\")","v":"Cycle pre-pack"}]
[" Item Brand Type",{"$f":"IF('New Item Form '!E83<>\"\",1,0)","v":0},1,{"$f":"IF((B4-C4)<0,\"Cycle pre-pack\",\"\")","v":"Cycle pre-pack"}]
[" Sourcing Indicator",{"$f":"IF('New Item Form '!F85<>\"\",1,0)","v":0},1,"Cycle pre-pack"]
[" CM Brand Classification",{"$f":"IF('New Item Form '!S83<>\"\",1,0)","v":0},1,"Cycle pre-pack"]
{"$rows_left_out":83}
{"sheet":"Options","index":12,"n_rows":40,"n_cols":8,"rows_kept":40,"cut":false,"hidden":true,"merged":[[0,1,6,1]]}
["Item Types Required For Vendors",null,"Item Types Required for CMs",null,"Brand Classification for Store Brand"]
["1. Standard",null,"1. Cycle Pre-Pack",null," ",{"$f":"IF('New Item Form'!$S$19 = \"NO\",Options!E2,NULL)","v":{"$error":"#NAME?"}},null,{"$f":"IFERROR(INDEX($F$2:$F$40,SMALL(IF(ISERROR($F$2:$F$40),\"\",ROW($F$2:$F$40)-MIN(ROW($F$2:$F$40))+1),ROW(D1))),\"\")","v":""}]
["2. Bonus",null,"2. Intended for POG",null,"Aftera",{"$f":"IF('New Item Form'!$S$19 = \"YES\",Options!E3,NULL)","v":{"$error":"#NAME?"}},null,{"$f":"IFERROR(INDEX($F$2:$F$40,SMALL(IF(ISERROR($F$2:$F$40),\"\",ROW($F$2:$F$40)-MIN(ROW($F$2:$F$40))+1),ROW(D2))),\"\")","v":""}]
["3. Beverage",null,"3. Not for Plano",null,"Beauty 360",{"$f":"IF('New Item Form'!$S$19 = \"YES\",Options!E4,NULL)","v":{"$error":"#NAME?"}},null,{"$f":"IFERROR(INDEX($F$2:$F$40,SMALL(IF(ISERROR($F$2:$F$40),\"\",ROW($F$2:$F$40)-MIN(ROW($F$2:$F$40))+1),ROW(D3))),\"\")","v":""}]
["4. Gift Card",null,"4. Off-Shelf",null,"Blade",{"$f":"IF('New Item Form'!$S$19 = \"YES\",Options!E5,NULL)","v":{"$error":"#NAME?"}},null,{"$f":"IFERROR(INDEX($F$2:$F$40,SMALL(IF(ISERROR($F$2:$F$40),\"\",ROW($F$2:$F$40)-MIN(ROW($F$2:$F$40))+1),ROW(D4))),\"\")","v":""}]
["5. PSE",null,"5. Promotional",null,"Caliber",{"$f":"IF('New Item Form'!$S$19 = \"YES\",Options!E6,NULL)","v":{"$error":"#NAME?"}},null,{"$f":"IFERROR(INDEX($F$2:$F$40,SMALL(IF(ISERROR($F$2:$F$40),\"\",ROW($F$2:$F$40)-MIN(ROW($F$2:$F$40))+1),ROW(D5))),\"\")","v":""}]
{"$rows_left_out":34}